Reaction Details
TargetSUMO-activating enzyme subunit 1
LigandBDBM61260
Substrate/Competitorn/a
Meas. Tech.uHTS HTRF assay for identification of inhibitors of SUMOylation
IC50 6100±n/a nM
Citation PubChem, PC uHTS HTRF assay for identification of inhibitors of SUMOylation PubChem Bioassay(2010)[AID]
 
SUMO-activating enzyme subunit 1
Name:SUMO-activating enzyme subunit 1
Type:Enzyme Catalytic Domain
Mol. Mass.:38440.84
Organism:Homo sapiens (Human)
Description:gi_17390638
Residue:346
BDBM61260
NameBDBM61260
Synonyms:3-(2,5-dioxo-1-pyrrolidinyl)-N-(4-methoxy-7-methyl-1,3-benzothiazol-2-yl)benzamide 3-[2,5-bis(oxidanylidene)pyrrolidin-1-yl]-N-(4-methoxy-7-methyl-1,3-benzothiazol-2-yl)benzamide N-(4-methoxy-7-methyl-1,3-benzothiazol-2-yl)-3-succinimido-benzamide cid_7172926
TypeSmall organic molecule
Emp. Form.C20H17N3O4S
Mol. Mass.395.432
SMILESCOc1ccc(C)c2sc(NC(=O)c3cccc(c3)-n3c(O)ccc3O)nc12