Reaction Details
TargetG-protein coupled receptor 55
LigandBDBM50925
Substrate/Competitorn/a
Meas. Tech.Image-Based HTS for Selective Antagonists for GPR55
IC50 2578.279±n/a nM
Citation PubChem, PC Image-Based HTS for Selective Antagonists for GPR55 PubChem Bioassay(2010)[AID]
 
G-protein coupled receptor 55
Name:G-protein coupled receptor 55
Type:PROTEIN
Mol. Mass.:36649.72
Organism:Homo sapiens (Human)
Description:ChEMBL_1292265
Residue:319
BDBM50925
NameBDBM50925
Synonyms:5-methyl-4-phenyl-cyclopenta[c]quinolizine-1,2-dicarboxylic acid dimethyl ester MLS000537611 cid_990753 dimethyl 5-methyl-4-phenylcyclopenta[c]quinolizine-1,2-dicarboxylate
TypeSmall organic molecule
Emp. Form.C23H19NO4
Mol. Mass.373.4013
SMILESCOC(=O)c1cc2c(-c3ccccc3)c(C)c3ccccn3c2c1C(=O)OC