Reaction Details
TargetG-protein coupled receptor 55
LigandBDBM61476
Substrate/Competitorn/a
Meas. Tech.Image-Based HTS for Selective Antagonists for GPR55
IC50 798.7131±n/a nM
Citation PubChem, PC Image-Based HTS for Selective Antagonists for GPR55 PubChem Bioassay(2010)[AID]
 
G-protein coupled receptor 55
Name:G-protein coupled receptor 55
Type:PROTEIN
Mol. Mass.:36649.72
Organism:Homo sapiens (Human)
Description:ChEMBL_1292265
Residue:319
BDBM61476
NameBDBM61476
Synonyms:MLS000579709 [2-[1-(dimethylamino)ethyl]phenyl]-(2,4-dimethylphenyl)-phenyl-methanol cid_2854345 | {2-[1-(dimethylamino)ethyl]phenyl}(2,4-dimethylphenyl)phenylmethanol
TypeSmall organic molecule
Emp. Form.C25H29NO
Mol. Mass.359.5039
SMILESCC(N(C)C)c1ccccc1C(O)(c1ccccc1)c1ccc(C)cc1C