Reaction Details
TargetG-protein coupled receptor 55
LigandBDBM61529
Substrate/Competitorn/a
Meas. Tech.Image-Based HTS for Selective Antagonists for GPR55
IC50 968.5314±n/a nM
Citation PubChem, PC Image-Based HTS for Selective Antagonists for GPR55 PubChem Bioassay(2010)[AID]
 
G-protein coupled receptor 55
Name:G-protein coupled receptor 55
Type:PROTEIN
Mol. Mass.:36649.72
Organism:Homo sapiens (Human)
Description:ChEMBL_1292265
Residue:319
BDBM61529
NameBDBM61529
Synonyms:2-(1-adamantyl)-N-(2-furfurylthiocarbamoyl)acetamide 2-(1-adamantyl)-N-(furan-2-ylmethylcarbamothioyl)ethanamide 2-(1-adamantyl)-N-{[(2-furylmethyl)amino]carbonothioyl}acetamide SMR000294791 | cid_2959710
TypeSmall organic molecule
Emp. Form.C18H24N2O2S
Mol. Mass.332.46
SMILES[H]C12CC3([H])CC([H])(C1)CC(CC(=O)NC(=S)NCc1ccco1)(C2)C3