Reaction Details
TargetG-protein coupled receptor 55
LigandBDBM48878
Substrate/Competitorn/a
Meas. Tech.Image-Based HTS for Selective Antagonists for GPR55
IC50 500±n/a nM
Citation PubChem, PC Image-Based HTS for Selective Antagonists for GPR55 PubChem Bioassay(2010)[AID]
 
G-protein coupled receptor 55
Name:G-protein coupled receptor 55
Type:PROTEIN
Mol. Mass.:36649.72
Organism:Homo sapiens (Human)
Description:ChEMBL_1292265
Residue:319
BDBM48878
NameBDBM48878
Synonyms:4-((3E)-3-{[5-(4-nitrophenyl)-2-furyl]methylene}-2-oxo-5-phenyl-2,3-dihydro-1H-pyrrol-1-yl)benzoic acid 4-[(3E)-3-[[5-(4-nitrophenyl)-2-furanyl]methylidene]-2-oxo-5-phenyl-1-pyrrolyl]benzoic acid 4-[(3E)-3-[[5-(4-nitrophenyl)furan-2-yl]methylidene]-2-oxo-5-phenylpyrrol-1-yl]benzoic acid SMR000312561 | cid_16195554
TypeSmall organic molecule
Emp. Form.C28H18N2O6
Mol. Mass.478.4523
SMILESOC(=O)c1ccc(cc1)N1C(=O)\C(=C\c2ccc(o2)-c2ccc(cc2)[N+]([O-])=O)C=C1c1ccccc1