Reaction Details
TargetG-protein coupled receptor 55
LigandBDBM61562
Substrate/Competitorn/a
Meas. Tech.Image-Based HTS for Selective Antagonists for GPR55
IC50 653.293±n/a nM
Citation PubChem, PC Image-Based HTS for Selective Antagonists for GPR55 PubChem Bioassay(2010)[AID]
 
G-protein coupled receptor 55
Name:G-protein coupled receptor 55
Type:PROTEIN
Mol. Mass.:36649.72
Organism:Homo sapiens (Human)
Description:ChEMBL_1292265
Residue:319
BDBM61562
NameBDBM61562
Synonyms:(5Z)-3-methyl-5-[(5-phenyl-1H-pyrazol-4-yl)methylene]-2-thioxo-thiazolidin-4-one (5Z)-3-methyl-5-[(5-phenyl-1H-pyrazol-4-yl)methylidene]-2-sulfanylidene-4-thiazolidinone MLS000769503 cid_1981775
TypeSmall organic molecule
Emp. Form.C14H11N3OS2
Mol. Mass.301.387
SMILESCN1C(=S)SC(=Cc2c[nH]nc2-c2ccccc2)C1=O