Reaction Details
TargetG-protein coupled receptor 55
LigandBDBM61568
Substrate/Competitorn/a
Meas. Tech.Image-Based HTS for Selective Antagonists for GPR55
IC50 500±n/a nM
Citation PubChem, PC Image-Based HTS for Selective Antagonists for GPR55 PubChem Bioassay(2010)[AID]
 
G-protein coupled receptor 55
Name:G-protein coupled receptor 55
Type:PROTEIN
Mol. Mass.:36649.72
Organism:Homo sapiens (Human)
Description:ChEMBL_1292265
Residue:319
BDBM61568
NameBDBM61568
Synonyms:(5Z)-1-(2,5-dimethoxyphenyl)-5-[(2-methyl-1H-indol-3-yl)methylene]barbituric acid 1-(2,5-Dimethoxy-phenyl)-5-[1-(2-methyl-1H-indol-3-yl)-meth-(Z)-ylidene]-pyrimidine-2,4,6-trione SMR000431607 | cid_5599957
TypeSmall organic molecule
Emp. Form.C22H19N3O5
Mol. Mass.405.4034
SMILESCOc1ccc(OC)c(c1)N1C(=O)NC(=O)C(=Cc2c(C)[nH]c3ccccc23)C1=O