Reaction Details
TargetVoltage-dependent N-type calcium channel subunit alpha-1B
LigandBDBM51541
Substrate/Competitorn/a
Meas. Tech.Homogeneous Time-Resolved Fluorescence Resonance Energy Transfer (HTRF) Assay
IC50 1940±n/a nM
Citation PubChem, PC Homogeneous Time-Resolved Fluorescence Resonance Energy Transfer (HTRF) Assay PubChem Bioassay(2009)[AID]
 
Voltage-dependent N-type calcium channel subunit alpha-1B
Name:Voltage-dependent N-type calcium channel subunit alpha-1B
Type:Enzyme
Mol. Mass.:262548.16
Organism:Homo sapiens (Human)
Description:Q00975
Residue:2339
BDBM51541
NameBDBM51541
Synonyms:2-(4-Amino-phenyl)-4-chloro-3H-benzoimidazol-5-ylamine 2-(4-aminophenyl)-4-chloro-1H-benzimidazol-5-amine SMR000019041 cid_762544
TypeSmall organic molecule
Emp. Form.C13H11ClN4
Mol. Mass.258.706
SMILESNc1ccc(cc1)-c1nc2ccc(N)c(Cl)c2[nH]1