Reaction Details
TargetVoltage-dependent N-type calcium channel subunit alpha-1B
LigandBDBM60444
Substrate/Competitorn/a
Meas. Tech.Homogeneous Time-Resolved Fluorescence Resonance Energy Transfer (HTRF) Assay
IC50 3740±n/a nM
Citation PubChem, PC Homogeneous Time-Resolved Fluorescence Resonance Energy Transfer (HTRF) Assay PubChem Bioassay(2009)[AID]
 
Voltage-dependent N-type calcium channel subunit alpha-1B
Name:Voltage-dependent N-type calcium channel subunit alpha-1B
Type:Enzyme
Mol. Mass.:262548.16
Organism:Homo sapiens (Human)
Description:Q00975
Residue:2339
BDBM60444
NameBDBM60444
Synonyms:3-(4-methylphenyl)-6-oxidanylidene-8-thiophen-2-yl-2,4,7,8-tetrahydropyrido[2,1-b][1,3,5]thiadiazine-9-carbonitrile 6-keto-3-(p-tolyl)-8-(2-thienyl)-2,4,7,8-tetrahydropyrido[2,1-b][1,3,5]thiadiazine-9-carbonitrile SMR000127753 | cid_3160859
TypeSmall organic molecule
Emp. Form.C19H17N3OS2
Mol. Mass.367.488
SMILESCc1ccc(cc1)N1CSC2=C(C#N)C(CC(=O)N2C1)c1cccs1