Reaction Details
TargetVoltage-dependent N-type calcium channel subunit alpha-1B
LigandBDBM32340
Substrate/Competitorn/a
Meas. Tech.Homogeneous Time-Resolved Fluorescence Resonance Energy Transfer (HTRF) Assay
IC50 586±n/a nM
Citation PubChem, PC Homogeneous Time-Resolved Fluorescence Resonance Energy Transfer (HTRF) Assay PubChem Bioassay(2009)[AID]
 
Voltage-dependent N-type calcium channel subunit alpha-1B
Name:Voltage-dependent N-type calcium channel subunit alpha-1B
Type:Enzyme
Mol. Mass.:262548.16
Organism:Homo sapiens (Human)
Description:Q00975
Residue:2339
BDBM32340
NameBDBM32340
Synonyms:3-ethyl-6-methoxy-1H-benzo[de]cinnoline SMR000140796 | cid_2876479
TypeSmall organic molecule
Emp. Form.C14H14N2O
Mol. Mass.226.2738
SMILESCCc1n[nH]c2cccc3c(OC)ccc1c23