Reaction Details
TargetVoltage-dependent N-type calcium channel subunit alpha-1B
LigandBDBM50453
Substrate/Competitorn/a
Meas. Tech.Homogeneous Time-Resolved Fluorescence Resonance Energy Transfer (HTRF) Assay
IC50 3590±n/a nM
Citation PubChem, PC Homogeneous Time-Resolved Fluorescence Resonance Energy Transfer (HTRF) Assay PubChem Bioassay(2009)[AID]
 
Voltage-dependent N-type calcium channel subunit alpha-1B
Name:Voltage-dependent N-type calcium channel subunit alpha-1B
Type:Enzyme
Mol. Mass.:262548.16
Organism:Homo sapiens (Human)
Description:Q00975
Residue:2339
BDBM50453
NameBDBM50453
Synonyms:3-nitro-4-(N'-piperonylidenehydrazino)benzenesulfonamide 4-[2-(1,3-benzodioxol-5-ylmethylidene)hydrazinyl]-3-nitrobenzenesulfonamide SMR000242627 | cid_4418320
TypeSmall organic molecule
Emp. Form.C14H12N4O6S
Mol. Mass.364.333
SMILESNS(=O)(=O)c1ccc(N=NCc2ccc3OCOc3c2)c(c1)[N+]([O-])=O