Reaction Details
TargetVoltage-dependent N-type calcium channel subunit alpha-1B
LigandBDBM61724
Substrate/Competitorn/a
Meas. Tech.Homogeneous Time-Resolved Fluorescence Resonance Energy Transfer (HTRF) Assay
IC50 1840±n/a nM
Citation PubChem, PC Homogeneous Time-Resolved Fluorescence Resonance Energy Transfer (HTRF) Assay PubChem Bioassay(2009)[AID]
 
Voltage-dependent N-type calcium channel subunit alpha-1B
Name:Voltage-dependent N-type calcium channel subunit alpha-1B
Type:Enzyme
Mol. Mass.:262548.16
Organism:Homo sapiens (Human)
Description:Q00975
Residue:2339
BDBM61724
NameBDBM61724
Synonyms:(8S)-3-(3-methacrylamidophenyl)-7-(1-methylcyclopropanecarbonyl)-1-oxa-2,7-diazaspiro[4.4]non-2-ene-8-carboxamide (8S)-7-(1-methylcyclopropyl)carbonyl-3-[3-(2-methylprop-2-enoylamino)phenyl]-1-oxa-2,7-diazaspiro[4.4]non-2-ene-8-carboxamide MLS000562014 cid_16745487
TypeSmall organic molecule
Emp. Form.C22H26N4O4
Mol. Mass.410.4662
SMILESCC(=C)C(=O)Nc1cccc(c1)C1=NOC2(C[C@H](N(C2)C(=O)C2(C)CC2)C(N)=O)C1