Reaction Details
TargetVoltage-dependent N-type calcium channel subunit alpha-1B
LigandBDBM46213
Substrate/Competitorn/a
Meas. Tech.Homogeneous Time-Resolved Fluorescence Resonance Energy Transfer (HTRF) Assay
IC50 10400±n/a nM
Citation PubChem, PC Homogeneous Time-Resolved Fluorescence Resonance Energy Transfer (HTRF) Assay PubChem Bioassay(2009)[AID]
 
Voltage-dependent N-type calcium channel subunit alpha-1B
Name:Voltage-dependent N-type calcium channel subunit alpha-1B
Type:Enzyme
Mol. Mass.:262548.16
Organism:Homo sapiens (Human)
Description:Q00975
Residue:2339
BDBM46213
NameBDBM46213
Synonyms:2-[4-[[6-carbethoxy-3-keto-7-methyl-5-[4-(methylthio)phenyl]-5H-thiazolo[3,2-a]pyrimidin-2-ylidene]methyl]phenoxy]acetic acid 2-[4-[[6-ethoxycarbonyl-7-methyl-5-(4-methylsulfanylphenyl)-3-oxo-5H-[1,3]thiazolo[3,2-a]pyrimidin-2-ylidene]methyl]phenoxy]acetic acid ML120 cid_4302116
TypeSmall organic molecule
Emp. Form.C26H24N2O6S2
Mol. Mass.524.609
SMILESCCOC(=O)C1=C(C)N=c2sc(=Cc3ccc(OCC(O)=O)cc3)c(=O)n2C1c1ccc(SC)cc1