Reaction Details
TargetVoltage-dependent N-type calcium channel subunit alpha-1B
LigandBDBM51781
Substrate/Competitorn/a
Meas. Tech.Homogeneous Time-Resolved Fluorescence Resonance Energy Transfer (HTRF) Assay
IC50 3330±n/a nM
Citation PubChem, PC Homogeneous Time-Resolved Fluorescence Resonance Energy Transfer (HTRF) Assay PubChem Bioassay(2009)[AID]
 
Voltage-dependent N-type calcium channel subunit alpha-1B
Name:Voltage-dependent N-type calcium channel subunit alpha-1B
Type:Enzyme
Mol. Mass.:262548.16
Organism:Homo sapiens (Human)
Description:Q00975
Residue:2339
BDBM51781
NameBDBM51781
Synonyms:(5E)-1-(4-fluorophenyl)-5-(2-furanylmethylidene)-2-sulfanylidene-1,3-diazinane-4,6-dione (5E)-1-(4-fluorophenyl)-5-(furan-2-ylmethylidene)-2-sulfanylidene-1,3-diazinane-4,6-dione MLS001211808 cid_777365
TypeSmall organic molecule
Emp. Form.C15H9FN2O3S
Mol. Mass.316.307
SMILESFc1ccc(cc1)N1C(=S)NC(=O)C(=Cc2ccco2)C1=O