Reaction Details
TargetVoltage-dependent N-type calcium channel subunit alpha-1B
LigandBDBM61736
Substrate/Competitorn/a
Meas. Tech.Homogeneous Time-Resolved Fluorescence Resonance Energy Transfer (HTRF) Assay
IC50 4020±n/a nM
Citation PubChem, PC Homogeneous Time-Resolved Fluorescence Resonance Energy Transfer (HTRF) Assay PubChem Bioassay(2009)[AID]
 
Voltage-dependent N-type calcium channel subunit alpha-1B
Name:Voltage-dependent N-type calcium channel subunit alpha-1B
Type:Enzyme
Mol. Mass.:262548.16
Organism:Homo sapiens (Human)
Description:Q00975
Residue:2339
BDBM61736
NameBDBM61736
Synonyms:Benzofuran-2-carboxylic acid [4-(4-fluoro-benzoylamino)-2-methoxy-phenyl]-amide N-[4-[(4-fluorobenzoyl)amino]-2-methoxy-phenyl]coumarilamide N-[4-[(4-fluorophenyl)carbonylamino]-2-methoxy-phenyl]-1-benzofuran-2-carboxamide SMR000518534 | cid_1157633
TypeSmall organic molecule
Emp. Form.C23H17FN2O4
Mol. Mass.404.3905
SMILESCOc1cc(NC(=O)c2ccc(F)cc2)ccc1NC(=O)c1cc2ccccc2o1