Reaction Details
TargetVoltage-dependent N-type calcium channel subunit alpha-1B
LigandBDBM51783
Substrate/Competitorn/a
Meas. Tech.Homogeneous Time-Resolved Fluorescence Resonance Energy Transfer (HTRF) Assay
IC50 9810±n/a nM
Citation PubChem, PC Homogeneous Time-Resolved Fluorescence Resonance Energy Transfer (HTRF) Assay PubChem Bioassay(2009)[AID]
 
Voltage-dependent N-type calcium channel subunit alpha-1B
Name:Voltage-dependent N-type calcium channel subunit alpha-1B
Type:Enzyme
Mol. Mass.:262548.16
Organism:Homo sapiens (Human)
Description:Q00975
Residue:2339
BDBM51783
NameBDBM51783
Synonyms:3-[(5E)-5-[1-(2-chlorobenzyl)-2-keto-indolin-3-ylidene]-4-keto-2-thioxo-thiazolidin-3-yl]propionic acid 3-[(5E)-5-[1-[(2-chlorophenyl)methyl]-2-oxo-3-indolylidene]-4-oxo-2-sulfanylidene-3-thiazolidinyl]propanoic acid MLS001173336 cid_1570081
TypeSmall organic molecule
Emp. Form.C21H15ClN2O4S2
Mol. Mass.458.938
SMILESOC(=O)CCN1C(=S)S\C(C1=O)=C1\C(=O)N(Cc2ccccc2Cl)c2ccccc12