Reaction Details
TargetNeuropeptide Y receptor type 1
LigandBDBM25756
Substrate/Competitorn/a
Meas. Tech.Fluorescence-based counterscreen for agonists of NPY-Y2: cell-based high-throughput dose response assay for agonists of NPY-Y1.
EC50 9606±n/a nM
Citation PubChem, PC Fluorescence-based counterscreen for agonists of NPY-Y2: cell-based high-throughput dose response assay for agonists of NPY-Y1. PubChem Bioassay(2009)[AID]
 
Neuropeptide Y receptor type 1
Name:Neuropeptide Y receptor type 1
Type:Enzyme Catalytic Domain
Mol. Mass.:44399.07
Organism:Homo sapiens (Human)
Description:NPY-Y1 NPY1R HUMAN::P25929
Residue:384
BDBM25756
NameBDBM25756
Synonyms:(2R,3R)-2,3-dihydroxysuccinic acid;1-(isopropylamino)-3-[4-(2-methoxyethyl)phenoxy]propan-2-ol CHEMBL13 Spesicor metoprolol tartrate | {2-hydroxy-3-[4-(2-methoxyethyl)phenoxy]propyl}(propan-2-yl)amine
TypeSmall organic molecule
Emp. Form.C15H25NO3
Mol. Mass.267.3639
SMILESCOCCc1ccc(OCC(O)CNC(C)C)cc1