Reaction Details
TargetInduced myeloid leukemia cell differentiation protein Mcl-1
LigandBDBM31750
Substrate/Competitorn/a
Meas. Tech.Fluorescence polarization-based biochemical high throughput dose response assay for inhibitors of myeloid cell leukemia sequence 1 (MCL1) interactions with BIM-BH3 peptide.
IC50 13242±n/a nM
Citation PubChem, PC Fluorescence polarization-based biochemical high throughput dose response assay for inhibitors of myeloid cell leukemia sequence 1 (MCL1) interactions with BIM-BH3 peptide. PubChem Bioassay(2009)[AID]
 
Induced myeloid leukemia cell differentiation protein Mcl-1
Name:Induced myeloid leukemia cell differentiation protein Mcl-1
Type:Membrane; Single-pass membrane protein
Mol. Mass.:37332.87
Organism:Homo sapiens (Human)
Description:Q07820
Residue:350
BDBM31750
NameBDBM31750
Synonyms:5,6-bis(2-furanyl)-3-(methylthio)-1,2,4-triazine 5,6-bis(furan-2-yl)-3-methylsulfanyl-1,2,4-triazine cid_3053058
TypeSmall organic molecule
Emp. Form.C12H9N3O2S
Mol. Mass.259.284
SMILESCSc1nnc(-c2ccco2)c(n1)-c1ccco1