Reaction Details
TargetInduced myeloid leukemia cell differentiation protein Mcl-1
LigandBDBM54975
Substrate/Competitorn/a
Meas. Tech.Fluorescence polarization-based biochemical high throughput dose response assay for inhibitors of myeloid cell leukemia sequence 1 (MCL1) interactions with BIM-BH3 peptide.
IC50 13311±n/a nM
Citation PubChem, PC Fluorescence polarization-based biochemical high throughput dose response assay for inhibitors of myeloid cell leukemia sequence 1 (MCL1) interactions with BIM-BH3 peptide. PubChem Bioassay(2009)[AID]
 
Induced myeloid leukemia cell differentiation protein Mcl-1
Name:Induced myeloid leukemia cell differentiation protein Mcl-1
Type:Membrane; Single-pass membrane protein
Mol. Mass.:37332.87
Organism:Homo sapiens (Human)
Description:Q07820
Residue:350
BDBM54975
NameBDBM54975
Synonyms:MLS000394231 N-(4-methoxy-3-morpholin-4-ylsulfonylphenyl)-2,3-dihydro-1H-cyclopenta[b]quinoline-9-carboxamide N-[4-methoxy-3-(4-morpholinylsulfonyl)phenyl]-2,3-dihydro-1H-cyclopenta[b]quinoline-9-carboxamide cid_4840580
TypeSmall organic molecule
Emp. Form.C24H25N3O5S
Mol. Mass.467.537
SMILESCOc1ccc(NC(=O)c2c3CCCc3nc3ccccc23)cc1S(=O)(=O)N1CCOCC1