Reaction Details
TargetBcl-2-like protein 1
LigandBDBM61881
Substrate/Competitorn/a
Meas. Tech.Counterscreen for inhibitors of MCL1: fluorescence polarization-based biochemical high throughput dose response assay for inhibitors of BCL2-related protein, long isoform (BCLXL).
IC50 108803±n/a nM
Citation PubChem, PC Counterscreen for inhibitors of MCL1: fluorescence polarization-based biochemical high throughput dose response assay for inhibitors of BCL2-related protein, long isoform (BCLXL). PubChem Bioassay(2009)[AID]
 
Bcl-2-like protein 1
Name:Bcl-2-like protein 1
Type:Mitochondrion membrane; Single-pass membrane protein
Mol. Mass.:26039.60
Organism:Homo sapiens (Human)
Description:n/a
Residue:233
BDBM61881
NameBDBM61881
Synonyms:MLS001158749 N-(1,1-dioxo-3-thiolanyl)-N-ethyl-2-[(5Z)-5-(2-furanylmethylidene)-4-oxo-2-sulfanylidene-3-thiazolidinyl]propanamide N-[1,1-bis(oxidanylidene)thiolan-3-yl]-N-ethyl-2-[(5Z)-5-(furan-2-ylmethylidene)-4-oxidanylidene-2-sulfanylidene-1,3-thiazolidin-3-yl]propanamide cid_17578782
TypeSmall organic molecule
Emp. Form.C17H20N2O5S3
Mol. Mass.428.546
SMILESCCN(C1CCS(=O)(=O)C1)C(=O)C(C)N1C(=S)S\C(=C/c2ccco2)C1=O