Reaction Details
TargetPhosphotransferase
LigandBDBM46057
Substrate/Competitorn/a
Meas. Tech.Confirmation assay for inhibitors of Trypanosoma brucei hexokinase 1-Analogue-first series
IC50 1030±n/a nM
Citation PubChem, PC Confirmation assay for inhibitors of Trypanosoma brucei hexokinase 1-Analogue-first series PubChem Bioassay(2010)[AID]
 
Phosphotransferase
Name:Phosphotransferase
Synonyms:hexokinase
Type:Enzyme Catalytic Domain
Mol. Mass.:51160.00
Organism:Trypanosoma brucei
Description:gi_70832125
Residue:471
BDBM46057
NameBDBM46057
TypeSmall organic molecule
Emp. Form.C13H8FNOS
Mol. Mass.245.272
SMILESFc1ccc2sn(-c3ccccc3)c(=O)c2c1