Reaction Details
TargetPhosphotransferase
LigandBDBM46691
Substrate/Competitorn/a
Meas. Tech.Confirmation assay for inhibitors of Trypanosoma brucei hexokinase 1-Analogue-first series
IC50 1100±n/a nM
Citation PubChem, PC Confirmation assay for inhibitors of Trypanosoma brucei hexokinase 1-Analogue-first series PubChem Bioassay(2010)[AID]
 
Phosphotransferase
Name:Phosphotransferase
Synonyms:hexokinase
Type:Enzyme Catalytic Domain
Mol. Mass.:51160.00
Organism:Trypanosoma brucei
Description:gi_70832125
Residue:471
BDBM46691
NameBDBM46691
TypeSmall organic molecule
Emp. Form.C13H8ClNOS
Mol. Mass.261.727
SMILESClc1ccc(cc1)-n1sc2ccccc2c1=O