Reaction Details
TargetRegulator of G-protein signaling 4
LigandBDBM34972
Substrate/Competitorn/a
Meas. Tech.Dose response, multiplexed high-throughput screen for small molecule regulators of RGS family protein interactions, specifically RGS4-Galphao for SAR compounds
EC50 1099±n/a nM
Citation PubChem, PC Dose response, multiplexed high-throughput screen for small molecule regulators of RGS family protein interactions, specifically RGS4-Galphao for SAR compounds PubChem Bioassay(2010)[AID]
 
Regulator of G-protein signaling 4
Name:Regulator of G-protein signaling 4
Type:Enzyme
Mol. Mass.:23263.51
Organism:Homo sapiens (Human)
Description:P49798
Residue:205
BDBM34972
NameBDBM34972
Synonyms:MLS000759648 N''-[(E)-(2,3-dihydroxy-4-oxocyclohexa-2,5-dien-1-ylidene)methyl]-2-(2-morpholin-4-yl-1,3-thiazol-4-yl)acetohydrazide N''-[(Z)-(2,3-dihydroxy-4-keto-cyclohexa-2,5-dien-1-ylidene)methyl]-2-(2-morpholinothiazol-4-yl)acetohydrazide N'-[(Z)-(2,3-dihydroxy-4-keto-cyclohexa-2,5-dien-1-ylidene)methyl]-2-(2-morpholinothiazol-4-yl)acetohydrazide cid_6508305
TypeSmall organic molecule
Emp. Form.C16H18N4O5S
Mol. Mass.378.403
SMILESOc1ccc(C=NNC(=O)Cc2csc(n2)N2CCOCC2)c(O)c1O