Reaction Details
TargetRegulator of G-protein signaling 4
LigandBDBM47747
Substrate/Competitorn/a
Meas. Tech.Dose response, multiplexed high-throughput screen for small molecule regulators of RGS family protein interactions, specifically RGS4-Galphao for SAR compounds
EC50 9638±n/a nM
Citation PubChem, PC Dose response, multiplexed high-throughput screen for small molecule regulators of RGS family protein interactions, specifically RGS4-Galphao for SAR compounds PubChem Bioassay(2010)[AID]
 
Regulator of G-protein signaling 4
Name:Regulator of G-protein signaling 4
Type:Enzyme
Mol. Mass.:23263.51
Organism:Homo sapiens (Human)
Description:P49798
Residue:205
BDBM47747
NameBDBM47747
Synonyms:4-[(E)-[3-[3-(diethylsulfamoyl)phenyl]-5-thioxo-1H-1,2,4-triazol-4-yl]iminomethyl]benzoic acid methyl ester 4-[[3-[3-(diethylsulfamoyl)phenyl]-5-thioxo-1H-1,2,4-triazol-4-yl]iminomethyl]benzoic acid methyl ester SMR000243078 methyl 4-[[3-[3-(diethylsulfamoyl)phenyl]-5-sulfanylidene-1H-1,2,4-triazol-4-yl]iminomethyl]benzoate
TypeSmall organic molecule
Emp. Form.C21H23N5O4S2
Mol. Mass.473.568
SMILESCCN(CC)S(=O)(=O)c1cccc(c1)-c1n[nH]c(=S)n1N=Cc1ccc(cc1)C(=O)OC