Reaction Details
TargetRegulator of G-protein signaling 7
LigandBDBM47747
Substrate/Competitorn/a
Meas. Tech.Dose response, multiplexed high-throughput screen for small molecule regulators of RGS family protein interactions, specifically RGS7-Galphao for SAR Compounds
EC50 30000±n/a nM
Citation PubChem, PC Dose response, multiplexed high-throughput screen for small molecule regulators of RGS family protein interactions, specifically RGS7-Galphao for SAR Compounds PubChem Bioassay(2010)[AID]
 
Regulator of G-protein signaling 7
Name:Regulator of G-protein signaling 7
Type:Enzyme Catalytic Domain
Mol. Mass.:57675.72
Organism:Homo sapiens (Human)
Description:P49802
Residue:495
BDBM47747
NameBDBM47747
Synonyms:4-[(E)-[3-[3-(diethylsulfamoyl)phenyl]-5-thioxo-1H-1,2,4-triazol-4-yl]iminomethyl]benzoic acid methyl ester 4-[[3-[3-(diethylsulfamoyl)phenyl]-5-thioxo-1H-1,2,4-triazol-4-yl]iminomethyl]benzoic acid methyl ester SMR000243078 methyl 4-[[3-[3-(diethylsulfamoyl)phenyl]-5-sulfanylidene-1H-1,2,4-triazol-4-yl]iminomethyl]benzoate
TypeSmall organic molecule
Emp. Form.C21H23N5O4S2
Mol. Mass.473.568
SMILESCCN(CC)S(=O)(=O)c1cccc(c1)-c1n[nH]c(=S)n1N=Cc1ccc(cc1)C(=O)OC