Reaction Details
TargetRegulator of G-protein signaling 7
LigandBDBM34435
Substrate/Competitorn/a
Meas. Tech.Dose response, multiplexed high-throughput screen for small molecule regulators of RGS family protein interactions, specifically RGS7-Galphao for SAR Compounds
EC50 30000±n/a nM
Citation PubChem, PC Dose response, multiplexed high-throughput screen for small molecule regulators of RGS family protein interactions, specifically RGS7-Galphao for SAR Compounds PubChem Bioassay(2010)[AID]
 
Regulator of G-protein signaling 7
Name:Regulator of G-protein signaling 7
Type:Enzyme Catalytic Domain
Mol. Mass.:57675.72
Organism:Homo sapiens (Human)
Description:P49802
Residue:495
BDBM34435
NameBDBM34435
Synonyms:4-cyano-3-methyl-5-[[1-oxo-2-[[5-(phenylmethyl)-1,3,4-oxadiazol-2-yl]thio]ethyl]amino]-2-thiophenecarboxylic acid ethyl ester MLS000051364 cid_2222655 ethyl 5-({[(5-benzyl-1,3,4-oxadiazol-2-yl)thio]acetyl}amino)-4-cyano-3-methyl-2-thiophenecarboxylate | ethyl 5-[[2-[(5-benzyl-1,3,4-oxadiazol-2-yl)sulfanyl]acetyl]amino]-4-cyano-3-methylthiophene-2-carboxylate
TypeSmall organic molecule
Emp. Form.C20H18N4O4S2
Mol. Mass.442.511
SMILESCCOC(=O)c1sc(NC(=O)CSc2nnc(Cc3ccccc3)o2)c(C#N)c1C