Reaction Details
TargetRegulator of G-protein signaling 16
LigandBDBM33097
Substrate/Competitorn/a
Meas. Tech.Dose response, multiplexed high-throughput screen for small molecule regulators of RGS family protein interactions, specifically RGS16-Galphao for SAR Compounds
EC50 272±151.4 nM
Citation PubChem, PC Dose response, multiplexed high-throughput screen for small molecule regulators of RGS family protein interactions, specifically RGS16-Galphao for SAR Compounds PubChem Bioassay(2010)[AID]
 
Regulator of G-protein signaling 16
Name:Regulator of G-protein signaling 16
Type:Enzyme Catalytic Domain
Mol. Mass.:22748.87
Organism:Homo sapiens (Human)
Description:gi_156416009
Residue:202
BDBM33097
NameBDBM33097
Synonyms:3-[[7-(1,3-benzothiazol-2-ylsulfanyl)-4-nitro-2,1,3-benzoxadiazol-5-yl]amino]propyl acetate MLS000521052 acetic acid 3-[[7-(1,3-benzothiazol-2-ylthio)-4-nitro-2,1,3-benzoxadiazol-5-yl]amino]propyl ester cid_11957209
TypeSmall organic molecule
Emp. Form.C18H15N5O5S2
Mol. Mass.445.472
SMILESCC(=O)OCCCNc1cc(Sc2nc3ccccc3s2)c2nonc2c1[N+]([O-])=O