Reaction Details
TargetRegulator of G-protein signaling 8
LigandBDBM62218
Substrate/Competitorn/a
Meas. Tech.Dose response, multiplexed high-throughput screen for small molecule regulators of RGS family protein interactions, specifically RGS8-Galphao for SAR Compounds
EC50 30000±n/a nM
Citation PubChem, PC Dose response, multiplexed high-throughput screen for small molecule regulators of RGS family protein interactions, specifically RGS8-Galphao for SAR Compounds PubChem Bioassay(2010)[AID]
 
Regulator of G-protein signaling 8
Name:Regulator of G-protein signaling 8
Type:Enzyme Catalytic Domain
Mol. Mass.:20925.80
Organism:Homo sapiens (Human)
Description:gi_74355113
Residue:180
BDBM62218
NameBDBM62218
Synonyms:2,4-dimethyl-6-[2-[3-methyl-4-(3-methylphenyl)-1-piperazinyl]-2-oxoethyl]-1,6-naphthyridin-5-one 2,4-dimethyl-6-[2-[3-methyl-4-(3-methylphenyl)piperazin-1-yl]-2-oxoethyl]-1,6-naphthyridin-5-one KUC103673N | cid_44473129
TypeSmall organic molecule
Emp. Form.C24H28N4O2
Mol. Mass.404.5047
SMILESCC1CN(CCN1c1cccc(C)c1)C(=O)Cn1ccc2nc(C)cc(C)c2c1=O