Reaction Details
TargetRegulator of G-protein signaling 8
LigandBDBM47815
Substrate/Competitorn/a
Meas. Tech.Dose response, multiplexed high-throughput screen for small molecule regulators of RGS family protein interactions, specifically RGS8-Galphao for SAR Compounds
Ki 150±n/a nM
Citation PubChem, PC Dose response, multiplexed high-throughput screen for small molecule regulators of RGS family protein interactions, specifically RGS8-Galphao for SAR Compounds PubChem Bioassay(2010)[AID]
 
Regulator of G-protein signaling 8
Name:Regulator of G-protein signaling 8
Type:Enzyme Catalytic Domain
Mol. Mass.:20925.80
Organism:Homo sapiens (Human)
Description:gi_74355113
Residue:180
BDBM47815
NameBDBM47815
Synonyms:2-(4-Methoxy-phenyl)-[1,4]benzoquinone 2-(4-methoxyphenyl)cyclohexa-2,5-diene-1,4-dione SMR000427749 | cid_121637
TypeSmall organic molecule
Emp. Form.C13H10O3
Mol. Mass.214.2167
SMILESCOc1ccc(cc1)C1=CC(=O)C=CC1=O