Reaction Details
TargetRegulator of G-protein signaling 19
LigandBDBM47696
Substrate/Competitorn/a
Meas. Tech.Dose response, multiplexed high-throughput screen for small molecule regulators of RGS family protein interactions, specifically RGS19-Galphao for SAR Compounds
EC50 30000±n/a nM
Citation PubChem, PC Dose response, multiplexed high-throughput screen for small molecule regulators of RGS family protein interactions, specifically RGS19-Galphao for SAR Compounds PubChem Bioassay(2010)[AID]
 
Regulator of G-protein signaling 19
Name:Regulator of G-protein signaling 19
Type:Enzyme Catalytic Domain
Mol. Mass.:24631.38
Organism:Homo sapiens (Human)
Description:gi_86990435
Residue:217
BDBM47696
NameBDBM47696
Synonyms:4-[(3-carbamoyl-4,5-dimethyl-2-thienyl)amino]-4-keto-butyric acid methyl ester MLS000075656 SMR000012612 methyl 4-[(3-aminocarbonyl-4,5-dimethyl-thiophen-2-yl)amino]-4-oxidanylidene-butanoate | methyl 4-[(3-carbamoyl-4,5-dimethylthiophen-2-yl)amino]-4-oxobutanoate
TypeSmall organic molecule
Emp. Form.C12H16N2O4S
Mol. Mass.284.331
SMILESCOC(=O)CCC(=O)Nc1sc(C)c(C)c1C(N)=O