Reaction Details
TargetSphingosine 1-phosphate receptor 4
LigandBDBM41592
Substrate/Competitorn/a
Meas. Tech.Late stage fluorescence dose response cell-based screening assay for antagonists of the Sphingosine 1-Phosphate Receptor 4 (S1P4)
IC50 5278±n/a nM
Citation PubChem, PC Late stage fluorescence dose response cell-based screening assay for antagonists of the Sphingosine 1-Phosphate Receptor 4 (S1P4) PubChem Bioassay(2010)[AID]
 
Sphingosine 1-phosphate receptor 4
Name:Sphingosine 1-phosphate receptor 4
Type:G Protein-Coupled Receptor (GPCR)
Mol. Mass.:41647.39
Organism:Homo sapiens (Human)
Description:n/a
Residue:384
BDBM41592
NameBDBM41592
Synonyms:(Z)-2,3-bis(chloranyl)-N-(6-methoxypyridin-3-yl)-3-(phenylmethyl)sulfonyl-prop-2-enamide (Z)-3-benzylsulfonyl-2,3-dichloro-N-(6-methoxy-3-pyridyl)acrylamide 3-(benzylsulfonyl)-2,3-dichloro-N-(6-methoxy-3-pyridinyl)acrylamide SMR000125561 | cid_1472218
TypeSmall organic molecule
Emp. Form.C16H14Cl2N2O4S
Mol. Mass.401.264
SMILESCOc1ccc(NC(=O)C(\Cl)=C(\Cl)S(=O)(=O)Cc2ccccc2)cn1