Reaction Details
TargetSphingosine 1-phosphate receptor 4
LigandBDBM43513
Substrate/Competitorn/a
Meas. Tech.Late stage fluorescence dose response cell-based screening assay for antagonists of the Sphingosine 1-Phosphate Receptor 4 (S1P4)
IC50 3453±n/a nM
Citation PubChem, PC Late stage fluorescence dose response cell-based screening assay for antagonists of the Sphingosine 1-Phosphate Receptor 4 (S1P4) PubChem Bioassay(2010)[AID]
 
Sphingosine 1-phosphate receptor 4
Name:Sphingosine 1-phosphate receptor 4
Type:G Protein-Coupled Receptor (GPCR)
Mol. Mass.:41647.39
Organism:Homo sapiens (Human)
Description:n/a
Residue:384
BDBM43513
NameBDBM43513
Synonyms:3-(4-Phenyl-6-trifluoromethyl-pyrimidine-2-sulfonyl)-propionic acid methyl ester 3-[[4-phenyl-6-(trifluoromethyl)-2-pyrimidinyl]sulfonyl]propanoic acid methyl ester SMR000149692 methyl 3-[4-phenyl-6-(trifluoromethyl)pyrimidin-2-yl]sulfonylpropanoate
TypeSmall organic molecule
Emp. Form.C15H13F3N2O4S
Mol. Mass.374.335
SMILESCOC(=O)CCS(=O)(=O)c1nc(cc(n1)C(F)(F)F)-c1ccccc1