Reaction Details
TargetSphingosine 1-phosphate receptor 4
LigandBDBM46781
Substrate/Competitorn/a
Meas. Tech.Late stage fluorescence dose response cell-based screening assay for antagonists of the Sphingosine 1-Phosphate Receptor 4 (S1P4)
IC50 3697±n/a nM
Citation PubChem, PC Late stage fluorescence dose response cell-based screening assay for antagonists of the Sphingosine 1-Phosphate Receptor 4 (S1P4) PubChem Bioassay(2010)[AID]
 
Sphingosine 1-phosphate receptor 4
Name:Sphingosine 1-phosphate receptor 4
Type:G Protein-Coupled Receptor (GPCR)
Mol. Mass.:41647.39
Organism:Homo sapiens (Human)
Description:n/a
Residue:384
BDBM46781
NameBDBM46781
Synonyms:(3R,3aR)-2-benzoyl-3-(4-fluorobenzyl)-5-keto-4-methylene-1,3a-dihydrocyclopenta[c]pyrrole-3-carboxylic acid methyl ester MLS000563758 cid_3247230 methyl (3R,3aR)-3-[(4-fluorophenyl)methyl]-4-methylidene-5-oxidanylidene-2-(phenylcarbonyl)-1,3a-dihydrocyclopenta[c]pyrrole-3-carboxylate
TypeSmall organic molecule
Emp. Form.C24H20FNO4
Mol. Mass.405.4183
SMILESCOC(=O)[C@@]1(Cc2ccc(F)cc2)[C@@H]2C(CN1C(=O)c1ccccc1)=CC(=O)C2=C