Reaction Details
TargetSphingosine 1-phosphate receptor 4
LigandBDBM62230
Substrate/Competitorn/a
Meas. Tech.Late stage fluorescence dose response cell-based screening assay for antagonists of the Sphingosine 1-Phosphate Receptor 4 (S1P4)
IC50 1723±n/a nM
Citation PubChem, PC Late stage fluorescence dose response cell-based screening assay for antagonists of the Sphingosine 1-Phosphate Receptor 4 (S1P4) PubChem Bioassay(2010)[AID]
 
Sphingosine 1-phosphate receptor 4
Name:Sphingosine 1-phosphate receptor 4
Type:G Protein-Coupled Receptor (GPCR)
Mol. Mass.:41647.39
Organism:Homo sapiens (Human)
Description:n/a
Residue:384
BDBM62230
NameBDBM62230
Synonyms:5-nitro-2-(4-pyrimidinylthio)thiazole 5-nitro-2-pyrimidin-4-ylsulfanyl-1,3-thiazole SR-01000778562-2 | cid_100520
TypeSmall organic molecule
Emp. Form.C7H4N4O2S2
Mol. Mass.240.262
SMILES[O-][N+](=O)c1cnc(Sc2ccncn2)s1