Reaction Details
TargetSphingosine 1-phosphate receptor 4
LigandBDBM62391
Substrate/Competitorn/a
Meas. Tech.Late stage fluorescence dose response cell-based screening assay for antagonists of the Sphingosine 1-Phosphate Receptor 4 (S1P4): Synthesized analogues
IC50 269±n/a nM
Citation PubChem, PC Late stage fluorescence dose response cell-based screening assay for antagonists of the Sphingosine 1-Phosphate Receptor 4 (S1P4): Synthesized analogues PubChem Bioassay(2010)[AID]
 
Sphingosine 1-phosphate receptor 4
Name:Sphingosine 1-phosphate receptor 4
Type:G Protein-Coupled Receptor (GPCR)
Mol. Mass.:41647.39
Organism:Homo sapiens (Human)
Description:n/a
Residue:384
BDBM62391
NameBDBM62391
Synonyms:5-(2-chlorophenyl)-N-(2-ethyl-6-methyl-phenyl)-2-furamide 5-(2-chlorophenyl)-N-(2-ethyl-6-methylphenyl)-2-furancarboxamide SR-02000000235 cid_7275219
TypeSmall organic molecule
Emp. Form.C20H18ClNO2
Mol. Mass.339.815
SMILESCCc1cccc(C)c1NC(=O)c1ccc(o1)-c1ccccc1Cl