Reaction Details
TargetSphingosine 1-phosphate receptor 4
LigandBDBM62399
Substrate/Competitorn/a
Meas. Tech.Late stage fluorescence dose response cell-based screening assay for antagonists of the Sphingosine 1-Phosphate Receptor 4 (S1P4): Synthesized analogues
IC50 393±n/a nM
Citation PubChem, PC Late stage fluorescence dose response cell-based screening assay for antagonists of the Sphingosine 1-Phosphate Receptor 4 (S1P4): Synthesized analogues PubChem Bioassay(2010)[AID]
 
Sphingosine 1-phosphate receptor 4
Name:Sphingosine 1-phosphate receptor 4
Type:G Protein-Coupled Receptor (GPCR)
Mol. Mass.:41647.39
Organism:Homo sapiens (Human)
Description:n/a
Residue:384
BDBM62399
NameBDBM62399
Synonyms:5-(2,5-dichlorophenyl)-N-(2-methylphenyl)-2-furancarboxamide 5-(2,5-dichlorophenyl)-N-(o-tolyl)-2-furamide SR-02000000243 cid_779010
TypeSmall organic molecule
Emp. Form.C18H13Cl2NO2
Mol. Mass.346.207
SMILESCc1ccccc1NC(=O)c1ccc(o1)-c1cc(Cl)ccc1Cl