Reaction Details
TargetSphingosine 1-phosphate receptor 4
LigandBDBM62402
Substrate/Competitorn/a
Meas. Tech.Late stage fluorescence dose response cell-based screening assay for antagonists of the Sphingosine 1-Phosphate Receptor 4 (S1P4): Synthesized analogues
IC50 105±n/a nM
Citation PubChem, PC Late stage fluorescence dose response cell-based screening assay for antagonists of the Sphingosine 1-Phosphate Receptor 4 (S1P4): Synthesized analogues PubChem Bioassay(2010)[AID]
 
Sphingosine 1-phosphate receptor 4
Name:Sphingosine 1-phosphate receptor 4
Type:G Protein-Coupled Receptor (GPCR)
Mol. Mass.:41647.39
Organism:Homo sapiens (Human)
Description:n/a
Residue:384
BDBM62402
NameBDBM62402
Synonyms:5-(2,5-dichlorophenyl)-N-(2,6-diisopropylphenyl)-2-furamide 5-(2,5-dichlorophenyl)-N-[2,6-di(propan-2-yl)phenyl]furan-2-carboxamide SR-02000000246 cid_44607577
TypeSmall organic molecule
Emp. Form.C23H23Cl2NO2
Mol. Mass.416.34
SMILESCC(C)c1cccc(C(C)C)c1NC(=O)c1ccc(o1)-c1cc(Cl)ccc1Cl