Reaction Details
TargetDelta-type opioid receptor
LigandBDBM47164
Substrate/Competitorn/a
Meas. Tech.HTS Image-Based Screen for Antagonists of the DOR Receptor
IC50 10299±n/a nM
Citation PubChem, PC HTS Image-Based Screen for Antagonists of the DOR Receptor PubChem Bioassay(2010)[AID]
 
Delta-type opioid receptor
Name:Delta-type opioid receptor
Type:G Protein-Coupled Receptor (GPCR)
Mol. Mass.:40382.98
Organism:Homo sapiens (Human)
Description:Competition binding assays were carried out using membrane preparations from transfected HN9.10 cells that constitutively expressed the delta opioid receptor.
Residue:372
BDBM47164
NameBDBM47164
Synonyms:(4,5-dibromo-6-oxopyridazin-1-yl)methyl 4-fluorobenzoate 4-fluorobenzoic acid (4,5-dibromo-6-oxo-1-pyridazinyl)methyl ester SMR000126146 [4,5-dibromo-6-oxo-1(6H)-pyridazinyl]methyl 4-fluorobenzenecarboxylate | cid_1474489
TypeSmall organic molecule
Emp. Form.C12H7Br2FN2O3
Mol. Mass.406.002
SMILESFc1ccc(cc1)C(=O)OCn1ncc(Br)c(Br)c1=O