Reaction Details
TargetDelta-type opioid receptor
LigandBDBM54818
Substrate/Competitorn/a
Meas. Tech.HTS Image-Based Screen for Antagonists of the DOR Receptor
IC50 10371±n/a nM
Citation PubChem, PC HTS Image-Based Screen for Antagonists of the DOR Receptor PubChem Bioassay(2010)[AID]
 
Delta-type opioid receptor
Name:Delta-type opioid receptor
Type:G Protein-Coupled Receptor (GPCR)
Mol. Mass.:40382.98
Organism:Homo sapiens (Human)
Description:Competition binding assays were carried out using membrane preparations from transfected HN9.10 cells that constitutively expressed the delta opioid receptor.
Residue:372
BDBM54818
NameBDBM54818
Synonyms:(7-chloro-4-nitro-benzofurazan-5-yl)-methyl-amine 7-chloro-N-methyl-4-nitro-2,1,3-benzoxadiazol-5-amine SMR000285240 | cid_3128197
TypeSmall organic molecule
Emp. Form.C7H5ClN4O3
Mol. Mass.228.593
SMILESCNc1cc(Cl)c2nonc2c1[N+]([O-])=O