Reaction Details
TargetDelta-type opioid receptor
LigandBDBM54829
Substrate/Competitorn/a
Meas. Tech.HTS Image-Based Screen for Antagonists of the DOR Receptor
IC50 14666±n/a nM
Citation PubChem, PC HTS Image-Based Screen for Antagonists of the DOR Receptor PubChem Bioassay(2010)[AID]
 
Delta-type opioid receptor
Name:Delta-type opioid receptor
Type:G Protein-Coupled Receptor (GPCR)
Mol. Mass.:40382.98
Organism:Homo sapiens (Human)
Description:Competition binding assays were carried out using membrane preparations from transfected HN9.10 cells that constitutively expressed the delta opioid receptor.
Residue:372
BDBM54829
NameBDBM54829
Synonyms:2-(7-Chloro-4-nitro-benzo[1,2,5]oxadiazol-5-ylamino)-phenol 6-[(7-chloro-4-nitro-1,3-dihydro-2,1,3-benzoxadiazol-5-yl)imino]-1-cyclohexa-2,4-dienone 6-[(7-chloro-4-nitro-1,3-dihydrobenzofurazan-5-yl)imino]cyclohexa-2,4-dien-1-one SMR000516448 | cid_5719581
TypeSmall organic molecule
Emp. Form.C12H7ClN4O4
Mol. Mass.306.661
SMILES[O-]c1ccccc1Nc1cc(Cl)c2[nH+]onc2c1[N+]([O-])=O