Reaction Details
TargetTrans-activator protein BZLF1
LigandBDBM62517
Substrate/Competitorn/a
Meas. Tech.Counterscreen for inhibitors of EBNA-1: fluorescence polarization-based biochemical high throughput dose response assay to identify inhibitors of the Epstein-Barr virus-encoded protein, ZTA
IC50 111248±n/a nM
Citation PubChem, PC Counterscreen for inhibitors of EBNA-1: fluorescence polarization-based biochemical high throughput dose response assay to identify inhibitors of the Epstein-Barr virus-encoded protein, ZTA PubChem Bioassay(2010)[AID]
 
Trans-activator protein BZLF1
Name:Trans-activator protein BZLF1
Type:Enzyme Catalytic Domain
Mol. Mass.:26856.37
Organism:Human herpesvirus 4
Description:gi_82503229
Residue:245
BDBM62517
NameBDBM62517
Synonyms:5-methoxy-3-methyl-2-benzofurancarboxylic acid [2-(4-acetamidoanilino)-2-oxoethyl] ester MLS001129294 [2-(4-acetamidoanilino)-2-oxoethyl] 5-methoxy-3-methyl-1-benzofuran-2-carboxylate cid_7270392
TypeSmall organic molecule
Emp. Form.C21H20N2O6
Mol. Mass.396.3933
SMILESCOc1ccc2oc(C(=O)OCC(=O)Nc3ccc(NC(C)=O)cc3)c(C)c2c1