Reaction Details
TargetTrans-activator protein BZLF1
LigandBDBM62518
Substrate/Competitorn/a
Meas. Tech.Counterscreen for inhibitors of EBNA-1: fluorescence polarization-based biochemical high throughput dose response assay to identify inhibitors of the Epstein-Barr virus-encoded protein, ZTA
IC50 111248±n/a nM
Citation PubChem, PC Counterscreen for inhibitors of EBNA-1: fluorescence polarization-based biochemical high throughput dose response assay to identify inhibitors of the Epstein-Barr virus-encoded protein, ZTA PubChem Bioassay(2010)[AID]
 
Trans-activator protein BZLF1
Name:Trans-activator protein BZLF1
Type:Enzyme Catalytic Domain
Mol. Mass.:26856.37
Organism:Human herpesvirus 4
Description:gi_82503229
Residue:245
BDBM62518
NameBDBM62518
Synonyms:2-(2-keto-4-methyl-chromen-7-yl)oxy-N-(4-methoxy-3-piperidinosulfonyl-phenyl)acetamide N-(4-methoxy-3-piperidin-1-ylsulfonyl-phenyl)-2-(4-methyl-2-oxidanylidene-chromen-7-yl)oxy-ethanamide N-[4-methoxy-3-(1-piperidinylsulfonyl)phenyl]-2-[(4-methyl-2-oxo-1-benzopyran-7-yl)oxy]acetamide cid_16549413
TypeSmall organic molecule
Emp. Form.C24H26N2O7S
Mol. Mass.486.537
SMILESCOc1ccc(NC(=O)COc2ccc3c(C)cc(=O)oc3c2)cc1S(=O)(=O)N1CCCCC1