Reaction Details
TargetEpstein-Barr nuclear antigen 1
LigandBDBM62426
Substrate/Competitorn/a
Meas. Tech.Fluorescence polarization-based biochemical high throughput dose response assay for inhibitors of the Epstein-Barr virus nuclear antigen 1 (EBNA-1)
IC50 5352±n/a nM
Citation PubChem, PC Fluorescence polarization-based biochemical high throughput dose response assay for inhibitors of the Epstein-Barr virus nuclear antigen 1 (EBNA-1) PubChem Bioassay(2010)[AID]
 
Epstein-Barr nuclear antigen 1
Name:Epstein-Barr nuclear antigen 1
Type:Enzyme Catalytic Domain
Mol. Mass.:56444.81
Organism:Human herpesvirus 4
Description:gi_23893623
Residue:641
BDBM62426
NameBDBM62426
Synonyms:MLS000519029 cid_6737843
TypeSmall organic molecule
Emp. Form.C29H21N3O4
Mol. Mass.475.4947
SMILES[H]C12CC([H])(C=C1)C1C2C(=O)N(C1=O)c1ccc(cc1)C(=O)Nc1ccc(cc1)-c1nc2ccccc2o1