Reaction Details
TargetEpstein-Barr nuclear antigen 1
LigandBDBM62432
Substrate/Competitorn/a
Meas. Tech.Fluorescence polarization-based biochemical high throughput dose response assay for inhibitors of the Epstein-Barr virus nuclear antigen 1 (EBNA-1)
IC50 5473±n/a nM
Citation PubChem, PC Fluorescence polarization-based biochemical high throughput dose response assay for inhibitors of the Epstein-Barr virus nuclear antigen 1 (EBNA-1) PubChem Bioassay(2010)[AID]
 
Epstein-Barr nuclear antigen 1
Name:Epstein-Barr nuclear antigen 1
Type:Enzyme Catalytic Domain
Mol. Mass.:56444.81
Organism:Human herpesvirus 4
Description:gi_23893623
Residue:641
BDBM62432
NameBDBM62432
Synonyms:2-Amino-1-(4-sulfamoyl-phenyl)-1H-pyrrolo[2,3-b]quinoxaline-3-carboxylic acid (3-methoxy-propyl)-amide 2-amino-N-(3-methoxypropyl)-1-(4-sulfamoylphenyl)pyrrolo[3,2-b]quinoxaline-3-carboxamide MLS000550967 cid_1922038
TypeSmall organic molecule
Emp. Form.C21H22N6O4S
Mol. Mass.454.502
SMILESCOCCCNC(=O)c1c(N)n(-c2ccc(cc2)S(N)(=O)=O)c2nc3ccccc3nc12