Reaction Details
TargetEpstein-Barr nuclear antigen 1
LigandBDBM62459
Substrate/Competitorn/a
Meas. Tech.Fluorescence polarization-based biochemical high throughput dose response assay for inhibitors of the Epstein-Barr virus nuclear antigen 1 (EBNA-1)
IC50 5900±n/a nM
Citation PubChem, PC Fluorescence polarization-based biochemical high throughput dose response assay for inhibitors of the Epstein-Barr virus nuclear antigen 1 (EBNA-1) PubChem Bioassay(2010)[AID]
 
Epstein-Barr nuclear antigen 1
Name:Epstein-Barr nuclear antigen 1
Type:Enzyme Catalytic Domain
Mol. Mass.:56444.81
Organism:Human herpesvirus 4
Description:gi_23893623
Residue:641
BDBM62459
NameBDBM62459
Synonyms:1-(3-methoxyphenyl)-N-[5-[2-(4-methoxyphenyl)-2-oxidanylidene-ethyl]sulfanyl-1,3,4-thiadiazol-2-yl]-5-oxidanylidene-pyrrolidine-3-carboxamide 1-(3-methoxyphenyl)-N-[5-[[2-(4-methoxyphenyl)-2-oxoethyl]thio]-1,3,4-thiadiazol-2-yl]-5-oxo-3-pyrrolidinecarboxamide MLS000724886 cid_15944862
TypeSmall organic molecule
Emp. Form.C23H22N4O5S2
Mol. Mass.498.575
SMILESCOc1ccc(cc1)C(=O)CSc1nnc(NC(=O)C2CN(C(=O)C2)c2cccc(OC)c2)s1