Reaction Details
TargetEpstein-Barr nuclear antigen 1
LigandBDBM62470
Substrate/Competitorn/a
Meas. Tech.Fluorescence polarization-based biochemical high throughput dose response assay for inhibitors of the Epstein-Barr virus nuclear antigen 1 (EBNA-1)
IC50 5626±n/a nM
Citation PubChem, PC Fluorescence polarization-based biochemical high throughput dose response assay for inhibitors of the Epstein-Barr virus nuclear antigen 1 (EBNA-1) PubChem Bioassay(2010)[AID]
 
Epstein-Barr nuclear antigen 1
Name:Epstein-Barr nuclear antigen 1
Type:Enzyme Catalytic Domain
Mol. Mass.:56444.81
Organism:Human herpesvirus 4
Description:gi_23893623
Residue:641
BDBM62470
NameBDBM62470
Synonyms:3-(methylsulfamoyl)benzoic acid [2-[4-(6-methyl-1,3-benzothiazol-2-yl)anilino]-2-oxoethyl] ester MLS000417808 [2-[4-(6-methyl-1,3-benzothiazol-2-yl)anilino]-2-oxoethyl] 3-(methylsulfamoyl)benzoate cid_2112396
TypeSmall organic molecule
Emp. Form.C24H21N3O5S2
Mol. Mass.495.571
SMILESCNS(=O)(=O)c1cccc(c1)C(=O)OCC(=O)Nc1ccc(cc1)-c1nc2ccc(C)cc2s1