Reaction Details
TargetEpstein-Barr nuclear antigen 1
LigandBDBM62483
Substrate/Competitorn/a
Meas. Tech.Fluorescence polarization-based biochemical high throughput dose response assay for inhibitors of the Epstein-Barr virus nuclear antigen 1 (EBNA-1)
IC50 5559±n/a nM
Citation PubChem, PC Fluorescence polarization-based biochemical high throughput dose response assay for inhibitors of the Epstein-Barr virus nuclear antigen 1 (EBNA-1) PubChem Bioassay(2010)[AID]
 
Epstein-Barr nuclear antigen 1
Name:Epstein-Barr nuclear antigen 1
Type:Enzyme Catalytic Domain
Mol. Mass.:56444.81
Organism:Human herpesvirus 4
Description:gi_23893623
Residue:641
BDBM62483
NameBDBM62483
Synonyms:2-[(4-naphthalen-2-ylsulfonylpiperazin-1-yl)methyl]-1H-quinazolin-4-one 2-[[4-(2-naphthylsulfonyl)piperazino]methyl]-1H-quinazolin-4-one SMR000372327 | cid_4879718
TypeSmall organic molecule
Emp. Form.C23H22N4O3S
Mol. Mass.434.511
SMILESO=c1[nH]c(CN2CCN(CC2)S(=O)(=O)c2ccc3ccccc3c2)nc2ccccc12