Reaction Details
TargetEpstein-Barr nuclear antigen 1
LigandBDBM62493
Substrate/Competitorn/a
Meas. Tech.Fluorescence polarization-based biochemical high throughput dose response assay for inhibitors of the Epstein-Barr virus nuclear antigen 1 (EBNA-1)
IC50 6649±n/a nM
Citation PubChem, PC Fluorescence polarization-based biochemical high throughput dose response assay for inhibitors of the Epstein-Barr virus nuclear antigen 1 (EBNA-1) PubChem Bioassay(2010)[AID]
 
Epstein-Barr nuclear antigen 1
Name:Epstein-Barr nuclear antigen 1
Type:Enzyme Catalytic Domain
Mol. Mass.:56444.81
Organism:Human herpesvirus 4
Description:gi_23893623
Residue:641
BDBM62493
NameBDBM62493
Synonyms:MLS001163282 N-[3-[(4-bromophenyl)carbonylamino]phenyl]thiophene-2-carboxamide N-{3-[(4-bromobenzoyl)amino]phenyl}-2-thiophenecarboxamide cid_1273132
TypeSmall organic molecule
Emp. Form.C18H13BrN2O2S
Mol. Mass.401.277
SMILESBrc1ccc(cc1)C(=O)Nc1cccc(NC(=O)c2cccs2)c1