Reaction Details
TargetEpstein-Barr nuclear antigen 1
LigandBDBM62516
Substrate/Competitorn/a
Meas. Tech.Fluorescence polarization-based biochemical high throughput dose response assay for inhibitors of the Epstein-Barr virus nuclear antigen 1 (EBNA-1)
IC50 5762±n/a nM
Citation PubChem, PC Fluorescence polarization-based biochemical high throughput dose response assay for inhibitors of the Epstein-Barr virus nuclear antigen 1 (EBNA-1) PubChem Bioassay(2010)[AID]
 
Epstein-Barr nuclear antigen 1
Name:Epstein-Barr nuclear antigen 1
Type:Enzyme Catalytic Domain
Mol. Mass.:56444.81
Organism:Human herpesvirus 4
Description:gi_23893623
Residue:641
BDBM62516
NameBDBM62516
Synonyms:5-methoxy-3-methyl-2-benzofurancarboxylic acid [2-[2-methyl-5-(4-morpholinylsulfonyl)anilino]-2-oxoethyl] ester MLS001099519 [2-(2-methyl-5-morpholin-4-ylsulfonylanilino)-2-oxoethyl] 5-methoxy-3-methyl-1-benzofuran-2-carboxylate cid_24687714
TypeSmall organic molecule
Emp. Form.C24H26N2O8S
Mol. Mass.502.537
SMILESCOc1ccc2oc(C(=O)OCC(=O)Nc3cc(ccc3C)S(=O)(=O)N3CCOCC3)c(C)c2c1