Reaction Details
TargetEpstein-Barr nuclear antigen 1
LigandBDBM62518
Substrate/Competitorn/a
Meas. Tech.Fluorescence polarization-based biochemical high throughput dose response assay for inhibitors of the Epstein-Barr virus nuclear antigen 1 (EBNA-1)
IC50 5295±n/a nM
Citation PubChem, PC Fluorescence polarization-based biochemical high throughput dose response assay for inhibitors of the Epstein-Barr virus nuclear antigen 1 (EBNA-1) PubChem Bioassay(2010)[AID]
 
Epstein-Barr nuclear antigen 1
Name:Epstein-Barr nuclear antigen 1
Type:Enzyme Catalytic Domain
Mol. Mass.:56444.81
Organism:Human herpesvirus 4
Description:gi_23893623
Residue:641
BDBM62518
NameBDBM62518
Synonyms:2-(2-keto-4-methyl-chromen-7-yl)oxy-N-(4-methoxy-3-piperidinosulfonyl-phenyl)acetamide N-(4-methoxy-3-piperidin-1-ylsulfonyl-phenyl)-2-(4-methyl-2-oxidanylidene-chromen-7-yl)oxy-ethanamide N-[4-methoxy-3-(1-piperidinylsulfonyl)phenyl]-2-[(4-methyl-2-oxo-1-benzopyran-7-yl)oxy]acetamide cid_16549413
TypeSmall organic molecule
Emp. Form.C24H26N2O7S
Mol. Mass.486.537
SMILESCOc1ccc(NC(=O)COc2ccc3c(C)cc(=O)oc3c2)cc1S(=O)(=O)N1CCCCC1